#,"In which region do you live?","What is your current level of education?",Other,"Books / ebooks (e.g. Ember-CLI 101, Rock and Roll with Ember.js)","Reading code and examples","Ember Slack","emberjs.com blog","Source code, issue and PR tracking",Blogs,"Formal training","Screencasts or video training"," Reddit",Twitter,Google+,Facebook,"Newsletters (e.g. Ember Weekly)","Podcasts (e.g. EmberWeekend, Ember Land)","Local meetups",Conferences,discuss.emberjs.com,IRC,"ember/core-notes repo",Other,"I am a person with a disability","Person identifying as a woman or transgender","Person with a lesbian, gay, bisexual, queer, or other non-heterosexual sexual identity","Person of color",Other,"Yes, but prefer not to specify",No,"How long have you been working with Ember?","Grade your knowledge of JavaScript (higher means more knowledge)","Grade your knowledge of Ember (higher means more knowledge)",Developer,Designer,"Project manager",Dev-ops,"Systems administration",Student,"Leadership position (CTO, VP etc)",Other,"""I use Ember for work...""","Employee working on product(s)","Employee in a firm doing consulting/client work","Employee working on internal Ember projects","Independent product developer","Independent consultant",Other,Ruby,Python,JavaScript,PHP,"Elixir / Erlang",Go,.NET,Rust,Scala,Java,Other,"Sublime Text","WebStorm/Other Jetbrains",Vim,TextMate,Atom,"Visual Studio","VS Code",Notepad++,Emacs,Other,"Opened an issue","Opened a PR","Maintain a library or addon","Attended a meetup / conference","Presented at a meetup","Presented at a conference","Written a blog post / article","Given a talk / lecture / class","Member of an official Ember team","None of these",Other,"Mac OSX",Linux/Unix,Windows,Angular,Backbone,React,Meteor,Ionic,"jQuery Mobile",Sproutcore,Polymer,Marionette,Sencha,Other,1–10,11–20,21–50,51–100,101–500,"More than 500",None,1–10,11–20,21–50,51–100,101–500,"More than 500","I don’t know","In one year, how many Ember developers do you plan to employ?","What are the accessibility requirements for your business?","Does your business require applications to be internationalized?","pre 1.6",1.6,1.7,1.8,1.9,1.10,1.11,1.12,1.13,2.0,2.1,2.2,2.3,2.4,"2.5 Beta","Canary (master)","Custom fork","I don't know","Release (stable release like 2.4.1)","Beta (like 2.5.0-beta1)",Canary,LTS,pre-1.13,1.13,2.0,2.1,2.2,2.3,2.4,"2.5 Beta","Canary (master)","Custom fork","I don’t know","I use ember-network","I use ember-ajax","I use ember-model","I use ember-pouch","I use ember-orbit",None,Other,0.1,0.2,1.13,2.2-beta,2.3,2.4,"Canary (master)","Standard Ember templates (Handlebars/HTMLBars/Glimmer)",Emblem,Hamlbars,Other,Ember-CLI,Ember-Rails,Ember-CLI-Rails,Grunt,Gulp,Webpack,Other,Ruby,Python,JavaScript,PHP,.NET,"Elixir / Erlang",Go,Rust,Scala,Java,Other,"Rails (Ruby)","Sinatra (Ruby)","Grape (Ruby)","Symfony (PHP)","Laravel (PHP)","Django (Python)","Flask (Python)	","Express (Node)","Sails.js (Node)","MVC (.NET)","Spring (Java)","OSGi (Java)","Phoenix (Elixir)",Other,HAL,JSON-API,GraphQL,Falcor,HATEOAS,Rest.li,"A non-standards based library","I don't get to design my API","Custom design",Other," Ember-QUnit (Ember-CLI default)",Ember-Mocha,Jasmine,"Selenium (Cucumber)","We don’t write tests",Other,"< 3 months","3–6 months","6–9 months","9–12 months","12–18 months","18–24 months","> 24 months","Multiple times per day",Daily,"Every few days",Weekly,Monthly,"Less than once a month","Almost never","Haven’t shipped yet / still developing	","Ember-CLI Deploy",Jenkins,Rundeck,Git,Gulp,Grunt,"Rsync / SCP",FTP,"Bespoke scripts",Ansible,Docker,Rake,Capistrano,"Platform-specific deployment tool (e.g. Surge, Pagefront, Firebase, Heroku, GCP)","App Store / Native Shell (Google Play / App Store / Ad Hoc)",Other,"Username / password",Oauth1.0a,Oauth2.0,"Open ID Connect 1.0","No authentication",Other,"Desktop & mobile (fully responsive)","Desktop (not responsive)","Mobile web (not responsive)","Legacy desktop (Point-of-sale units, embedded devices)","Browser extension (Chrome/Firefox etc.)","Mobile native (Cordova/Phonegap/Crosswalk)","Desktop native (Electron/NW.js/MacGap/CEF)",Other,"The general public","Business consumers","Internal users","Mobile browsers","Modern browsers (last two versions)","Legacy Chrome, Firefox, Safari","IE 11","IE 10","IE 9","IE 8","Mobile browsers","Modern browsers (last two versions)","Legacy Chrome, Firefox, Safari","IE 11","IE 10","IE 9","IE 8","Prototypes only","An app that is used by tens of users","An app that is used by hundreds of users","An app that is used by thousands of users","An app that is used by millions of users","An app that is used on a corporate intranet","VPS (cloud infrastructure)","Self-hosted (dedicated infrastructure)","S3 (with or without CloudFront)",ElasticBeanstalk,Azure,"Google Cloud Storage","Rackspace Cloud","Heroku	",Firebase,Surge.sh,Pagefront,Other,"GitHub (public/private)","GitHub (enterprise)",Gitlab,Bitbucket,"Self hosted",Other,"App is private, behind an authentication flow, or this question generally does not apply","noscript tags","phantomjs or other pre-rendering (including Prerender.io)","Google's JavaScript execution","FastBoot or other use of the ""visit"" API.","Our app is indexable, but I don't know how","How many addons have you written (including private, unpublished libraries)?","How many addons have you published publicly?","Are your addons unit tested?","Are your addons acceptance tested?","pre 1.6",1.6,1.7,1.8,1.9,1.10,1.11,1.12,1.13,2.0,2.1,2.2,2.3,2.4,"2.5 Beta","Canary (master)","I don’t know","Mobile browsers","Modern browsers (last two versions)","Legacy Chrome, Firefox, Safari, or Edge","IE 11","IE 10","IE 9","IE 8","Start Date (UTC)","Submit Date (UTC)","Network ID"
e29c59a7050335ff7f94cef8aa645e30,"North America","College degree, technology related",,"Books / ebooks (e.g. Ember-CLI 101, Rock and Roll with Ember.js)",,"Ember Slack",,,,"Formal training","Screencasts or video training",,,,,"Newsletters (e.g. Ember Weekly)","Podcasts (e.g. EmberWeekend, Ember Land)","Local meetups",Conferences,,,,,"I am a person with a disability",,,"Person of color",,,,"24–36 months",8,8,Developer,,"Project manager",,,,"Leadership position (CTO, VP etc)",,"Most of the time",,,,,,"Instructor & Screencast Creator",,,JavaScript,PHP,,,,,,,,"Sublime Text",,,,Atom,,,,,,,"Opened a PR","Maintain a library or addon","Attended a meetup / conference","Presented at a meetup",,"Written a blog post / article",,"Member of an official Ember team",,,"Mac OSX",,,,Backbone,React,,,,,,Marionette,,,,,21–50,,,,,1–10,,,,,,,"I don’t know",,0,,1.6,,,,1.10,,,1.13,,,,2.3,,,,,,"Release (stable release like 2.4.1)",,,,pre-1.13,,2.0,,,2.3,,,,,,,,,,,,ember-network,0.1,0.2,1.13,,,2.4,,"Standard Ember templates (Handlebars/HTMLBars/Glimmer)",,,,Ember-CLI,,,,,,,,,JavaScript,PHP,,,,,,,,,,,,"Laravel (PHP)",,,"Express (Node)",,,,,,,,JSON-API,,,,,,,,"Ember REST Adapter"," Ember-QUnit (Ember-CLI default)",,,,"We don’t write tests",,,,,,,,"> 24 months",,,,Weekly,Monthly,,"Almost never",,,,,Git,,,"Rsync / SCP",,"Bespoke scripts",,,,,,,Fabric,"Username / password",,Oauth2.0,,,,"Desktop & mobile (fully responsive)",,,,,,,,"The general public","Business consumers","Internal users","Mobile browsers","Modern browsers (last two versions)",,,,,,"Mobile browsers","Modern browsers (last two versions)",,,,,,"Prototypes only","An app that is used by tens of users","An app that is used by hundreds of users",,,"An app that is used on a corporate intranet","VPS (cloud infrastructure)",,"S3 (with or without CloudFront)",,,"Google Cloud Storage",,,,Surge.sh,,,"GitHub (public/private)",,,Bitbucket,,,"App is private, behind an authentication flow, or this question generally does not apply",,"phantomjs or other pre-rendering (including Prerender.io)",,,,,"> 6",Some,Some,,,,,,,,,,,,,2.3,,,,,"Mobile browsers","Modern browsers (last two versions)","Legacy Chrome, Firefox, Safari, or Edge","IE 11","IE 10",,,"2016-03-04 21:58:55","2016-03-04 22:06:31",692cc7c0cf
b7b516c4ae69b6ce2df430efaf2c992f,"North America","College degree, computer science",,"Books / ebooks (e.g. Ember-CLI 101, Rock and Roll with Ember.js)",,,"emberjs.com blog",,,,,,,,,"Newsletters (e.g. Ember Weekly)",,,,discuss.emberjs.com,,,,,,,,,,No,"12–18 months",7,7,Developer,,,,,,"Leadership position (CTO, VP etc)",,"Some of the time",,,,,"Independent consultant",,Ruby,,,,,,,,,,,"Sublime Text",,,,,,,,,,,,,"Attended a meetup / conference","Presented at a meetup",,,,,,,"Mac OSX",,,,,,,,"jQuery Mobile",,,,,,1–10,,,,,,,1–10,,,,,,,"I don’t know","No requirement",0,,,,1.8,1.9,,,,,,,,,,,,,,"Release (stable release like 2.4.1)",,,,pre-1.13,,,,,,,,,,,,,,,,,,,,,,,,,"Standard Ember templates (Handlebars/HTMLBars/Glimmer)",,,,,Ember-Rails,,,,,,Ruby,,,,,,,,,,,"Rails (Ruby)",,,,,,,,,,,,,,,,,,,,"A non-standards based library",,,,,,,"Selenium (Cucumber)",,,,,,"9–12 months",,,,,,"Every few days",,,,,,,,,,,,,,,,,,Capistrano,,,,"Username / password",,,,,,,"Desktop (not responsive)",,,,,,,"The general public","Business consumers","Internal users",,"Modern browsers (last two versions)",,,,,,,"Modern browsers (last two versions)",,,,,,,,,"An app that is used by thousands of users",,,,"Self-hosted (dedicated infrastructure)",,,,,,,,,,,"GitHub (public/private)",,,,,,,,,"Google's JavaScript execution",,,0,0,"I'm not sure how to do this","I'm not sure how to do this",,,,,,,,,,,,,,,,,,,,,,,,,"2016-03-04 21:59:32","2016-03-04 22:06:43",045bca19ab
8c18c4f2b9914a952ee67e9d495ccbd8,Europe,"Advanced degree, computer science",,"Books / ebooks (e.g. Ember-CLI 101, Rock and Roll with Ember.js)","Reading code and examples","Ember Slack","emberjs.com blog","Source code, issue and PR tracking",Blogs,,"Screencasts or video training"," Reddit",Twitter,,,"Newsletters (e.g. Ember Weekly)","Podcasts (e.g. EmberWeekend, Ember Land)",,,,,"ember/core-notes repo",,,,"Person with a lesbian, gay, bisexual, queer, or other non-heterosexual sexual identity",,,,,"24–36 months",8,8,Developer,,,,,,,,"Most of the time",,"Employee in a firm doing consulting/client work","Employee working on internal Ember projects",,,,Ruby,,,,"Elixir / Erlang",,,,,,,,,Vim,,,,,,,,"Opened an issue","Opened a PR",,"Attended a meetup / conference","Presented at a meetup",,"Written a blog post / article","Given a talk / lecture / class",,,,"Mac OSX",,,,,,,,,,,,,,1–10,,,,,,,1–10,,,,,,,More,"No requirement",1,,,,,,,,,,,,2.2,2.3,2.4,,,,,"Release (stable release like 2.4.1)","Beta (like 2.5.0-beta1)",,LTS,,,,,2.2,2.3,2.4,,,,,,,,,,,,,,,2.2-beta,2.3,2.4,,"Standard Ember templates (Handlebars/HTMLBars/Glimmer)",,,,Ember-CLI,,,,,,,Ruby,,,,,,,,,,,"Rails (Ruby)",,,,,,,,,,,,,,,JSON-API,,,,,,,,," Ember-QUnit (Ember-CLI default)",,,,,,,,"6–9 months","9–12 months",,,,,,,Weekly,,,,,,,,,,,,,,,,,,,"App Store / Native Shell (Google Play / App Store / Ad Hoc)","Sent by email to client's team. Do not judge me :(","Username / password",,,,,,"Desktop & mobile (fully responsive)",,,,,"Mobile native (Cordova/Phonegap/Crosswalk)",,,"The general public",,"Internal users","Mobile browsers","Modern browsers (last two versions)",,"IE 11","IE 10","IE 9",,"Mobile browsers","Modern browsers (last two versions)",,"IE 11","IE 10","IE 9",,,,,"An app that is used by thousands of users",,"An app that is used on a corporate intranet",,,,,,,,,,,,"We don't get to choose that",,,Gitlab,,,,"App is private, behind an authentication flow, or this question generally does not apply",,,,,"Our app is indexable, but I don't know how",4–6,1–3,All,Some,,,,,,,,,,,,2.2,2.3,2.4,,,,"Mobile browsers","Modern browsers (last two versions)",,"IE 11","IE 10","IE 9",,"2016-03-04 21:59:44","2016-03-04 22:08:04",cde2bb0b20
b942131fb304f1a8273a7fe9f502aa88,"North America","College degree, computer science",,,,,,,Blogs,,," Reddit",,,,,,"Local meetups",,,,,,,,,,,,No,"24–36 months",8,8,,,,,,,"Leadership position (CTO, VP etc)",,"All the time","Employee working on product(s)",,,,,,,,JavaScript,,,,,,,,,"Sublime Text",,,,,,,,,,"Opened an issue","Opened a PR","Maintain a library or addon",,,,,,,,,"Mac OSX",,,Angular,,,,,"jQuery Mobile",,,,,,,,,,101–500,,,,,21–50,,,,,More,"Self-imposed requirement",1,,1.6,,,,1.10,,,,,,,,,,,,,,,,LTS,,,,,,,,,,,,,,,,,None,,,,,,2.3,,,"Standard Ember templates (Handlebars/HTMLBars/Glimmer)",,,,Ember-CLI,,,,,,,,,JavaScript,,,,,,,,,,,,,,,,,,,,,,HapiJs,,JSON-API,,,,,,,,,,Ember-Mocha,,,,,,,,,,,"> 24 months",,,,,Monthly,,,,,,,,,,,,,,Docker,,,,,,"Username / password",,,,,,"Desktop & mobile (fully responsive)",,,,,"Mobile native (Cordova/Phonegap/Crosswalk)",,,"The general public",,,"Mobile browsers","Modern browsers (last two versions)",,"IE 11","IE 10","IE 9",,"Mobile browsers","Modern browsers (last two versions)",,"IE 11","IE 10",,,,,,,"An app that is used by millions of users",,,"Self-hosted (dedicated infrastructure)",,,,,,,,,,,,,,,"Self hosted",,,"noscript tags",,,,,4–6,0,All,Some,,,,,,,,,1.13,,,,,,,,,"Mobile browsers","Modern browsers (last two versions)",,"IE 11","IE 10","IE 9",,"2016-03-04 22:00:49","2016-03-04 22:08:07",2593202153
4b1b5a871bcc697c81fd8a48673525b9,Europe,"College degree, computer science",,,"Reading code and examples","Ember Slack",,"Source code, issue and PR tracking",,,"Screencasts or video training",,Twitter,,,"Newsletters (e.g. Ember Weekly)","Podcasts (e.g. EmberWeekend, Ember Land)",,,,,"ember/core-notes repo",,,,,,,,No,"24–36 months",8,8,Developer,,,,,,,,"Most of the time",,,,,"Independent consultant",,Ruby,,,,"Elixir / Erlang",,,,,,,,,Vim,,Atom,,"VS Code",,,,"Opened an issue","Opened a PR","Maintain a library or addon","Attended a meetup / conference","Presented at a meetup",,"Written a blog post / article","Given a talk / lecture / class","Member of an official Ember team",,"Stack Overflow and Slack support","Mac OSX",,,,,React,,,,,Polymer,,,,,,,,,,,,,,,,,,,,1,,,,,,,,,1.13,,,,2.3,2.4,,,,,"Release (stable release like 2.4.1)",,,,pre-1.13,1.13,,,,2.3,2.4,,,,,,"I use ember-ajax",,"I use ember-pouch",,,,,,,,2.3,2.4,,"Standard Ember templates (Handlebars/HTMLBars/Glimmer)",,,,Ember-CLI,,,,,,,Ruby,,,,,"Elixir / Erlang",,,,,,"Rails (Ruby)","Sinatra (Ruby)",,,,,,,,,,,"Phoenix (Elixir)",,HAL,JSON-API,,,HATEOAS,,,,,"Ruby on Rails"," Ember-QUnit (Ember-CLI default)",,,,,,"< 3 months","3–6 months","6–9 months","9–12 months",,,,,,"Every few days",Weekly,Monthly,,,"Haven’t shipped yet / still developing	","Ember-CLI Deploy",,,Git,,,,,,,,,,"Platform-specific deployment tool (e.g. Surge, Pagefront, Firebase, Heroku, GCP)",,,"Username / password",,Oauth2.0,,"No authentication",,"Desktop & mobile (fully responsive)",,,,"Browser extension (Chrome/Firefox etc.)",,"Desktop native (Electron/NW.js/MacGap/CEF)",,"The general public","Business consumers","Internal users","Mobile browsers","Modern browsers (last two versions)",,,,,,"Mobile browsers","Modern browsers (last two versions)",,,,,,"Prototypes only","An app that is used by tens of users","An app that is used by hundreds of users","An app that is used by thousands of users",,,,,,,,,,,,Surge.sh,Pagefront,,"GitHub (public/private)",,Gitlab,,,,"App is private, behind an authentication flow, or this question generally does not apply","noscript tags",,"Google's JavaScript execution",,"Our app is indexable, but I don't know how",4–6,1–3,Some,Some,,,,,,,,,1.13,2.0,2.1,2.2,2.3,2.4,,,,"Mobile browsers","Modern browsers (last two versions)",,,,,,"2016-03-04 21:58:32","2016-03-04 22:13:07",04e6918d51
2e241e873b89caab4bc1c0ccaef8ff8f,"North America","College degree, not technology related",,"Books / ebooks (e.g. Ember-CLI 101, Rock and Roll with Ember.js)","Reading code and examples","Ember Slack","emberjs.com blog","Source code, issue and PR tracking",,,,,Twitter,,,,"Podcasts (e.g. EmberWeekend, Ember Land)","Local meetups",Conferences,discuss.emberjs.com,,,,,,,,,,No,"9–12 months",6,7,Developer,Designer,"Project manager",Dev-ops,"Systems administratoin",,"Leadership position (CTO, VP etc)",,"All the time",,,,"Independent product developer","Independent consultant",,Ruby,,JavaScript,PHP,"Elixir / Erlang",,,,,,,"Sublime Text",,Vim,,,,,,,,"Opened an issue","Opened a PR",,"Attended a meetup / conference","Presented at a meetup",,"Written a blog post / article","Given a talk / lecture / class",,,,"Mac OSX",,,,Backbone,,,,"jQuery Mobile",,,,,,1–10,,,,,,,1–10,,,,,,,"I don’t know","Self-imposed requirement",0,,,,,,,,,,,,,,2.4,,,,,"Release (stable release like 2.4.1)",,,,,,,,,,2.4,,,,,,,,,,,,,,,,,2.4,,"Standard Ember templates (Handlebars/HTMLBars/Glimmer)",,,,Ember-CLI,,,,,,,Ruby,,,,,,,,,,,"Rails (Ruby)",,,,,,,,,,,,,,,,,,,,"A non-standards based library",,"Custom design",," Ember-QUnit (Ember-CLI default)",,,,,,,,"6–9 months",,,,,,,"Every few days",,,,,,"Ember-CLI Deploy",,,,,,,,,,,,,,,,"Username / password",,Oauth2.0,,,,"Desktop & mobile (fully responsive)",,,,,,,,"The general public","Business consumers","Internal users",,"Modern browsers (last two versions)",,,,,,,"Modern browsers (last two versions)",,,,,,,"An app that is used by tens of users",,,,,,,"S3 (with or without CloudFront)",,,,,,,,,,,,,Bitbucket,,,"App is private, behind an authentication flow, or this question generally does not apply",,,,,,1–3,0,Some,"I'm not sure how to do this",,,,,,,,,,,,,,,,,"I don’t know",,"Modern browsers (last two versions)",,,,,,"2016-03-04 22:07:27","2016-03-04 22:13:07",afc1da7ab0
95d10e10d612f1391bd3c26ed865eddb,"North America","College degree, computer science",,,"Reading code and examples",,,,Blogs,,"Screencasts or video training",,Twitter,,,"Newsletters (e.g. Ember Weekly)",,"Local meetups",,,,,,,,,,,,No,"36–51 months",9,9,Developer,Designer,,,,,,,"All the time","Employee working on product(s)",,"Employee working on internal Ember projects","Independent product developer",,,,,JavaScript,,,,.NET,,,,,,,,,Atom,,,,,,,,,"Attended a meetup / conference",,"Presented at a conference","Written a blog post / article","Given a talk / lecture / class",,,,"Mac OSX",,,,Backbone,React,Meteor,,,,Polymer,Marionette,,,,,21–50,,,,,1–10,,,,,,,"The same amount","No requirement",0,,,,,,,,,,,,,,2.4,,,,,"Release (stable release like 2.4.1)",,,,,,,,,,2.4,,,,,,,,,,,,,,,,,2.4,,"Standard Ember templates (Handlebars/HTMLBars/Glimmer)",,,,Ember-CLI,,,Grunt,,,,,,,,,,,,Scala,,,,,,,,,,,,,,,,,,,,,,,,"I don't get to design my API",,," Ember-QUnit (Ember-CLI default)",,,,,,,,,,"12–18 months",,,,,,,Monthly,,,,"Ember-CLI Deploy",Jenkins,,Git,,Grunt,,,"Bespoke scripts",,,,,,,,"Username / password",,,,,,,"Desktop (not responsive)",,,,,,,,"Business consumers","Internal users",,"Modern browsers (last two versions)",,"IE 11","IE 10","IE 9",,,"Modern browsers (last two versions)",,"IE 11","IE 10","IE 9",,,,,"An app that is used by thousands of users",,"An app that is used on a corporate intranet",,"Self-hosted (dedicated infrastructure)",,,,,,,,,,,"GitHub (public/private)",,,,,,"App is private, behind an authentication flow, or this question generally does not apply",,,,,,0,0,,,,,,,,,,,,,,,,,,,,,,,,,,,"2016-03-04 22:08:15","2016-03-04 22:13:09",3578aa66df
1ab6b9f2bd87f7eb610150ad1ee2c62a,"North America","College degree, technology related",,,,"Ember Slack","emberjs.com blog",,Blogs,,," Reddit",Twitter,,,,"Podcasts (e.g. EmberWeekend, Ember Land)",,,discuss.emberjs.com,,,,,,,,,,No,"18–24 months",7,8,Developer,,,,,,,,"Some of the time",,"Employee in a firm doing consulting/client work",,,,,Ruby,,,PHP,"Elixir / Erlang",,,,,,,,,Vim,,Atom,,,,,,,,,,,,,"Given a talk / lecture / class",,,,"Mac OSX",,,Angular,,React,,,"jQuery Mobile",,,,,,1–10,,,,,,,1–10,,,,,,,More,"Self-imposed requirement",0,,,,,,,,,,,,2.2,2.3,2.4,,,,,"Release (stable release like 2.4.1)",,,LTS,,,,,2.2,2.3,2.4,,,,,,,,,,,,,,,,2.3,,,"Standard Ember templates (Handlebars/HTMLBars/Glimmer)",,,,Ember-CLI,,,,,,,Ruby,,,,,,,,,,,"Rails (Ruby)","Sinatra (Ruby)",,,,,,,,,,,"Phoenix (Elixir)",,,JSON-API,,,,,,,,," Ember-QUnit (Ember-CLI default)",,,,,,,,"6–9 months",,,,,,,,,,"Less than once a month",,,,,,Git,,,,,,,,,,,,,,,,,"No authentication",,"Desktop & mobile (fully responsive)",,,,,,,,"The general public",,,,"Modern browsers (last two versions)",,,,,,,"Modern browsers (last two versions)",,,,,,,"An app that is used by tens of users",,,,,"VPS (cloud infrastructure)",,,,,,,,,,,,"GitHub (public/private)",,,,,,"App is private, behind an authentication flow, or this question generally does not apply",,,,,,0,0,All,All,,,,,,,,,,,,,,,,,"I don’t know",,"Modern browsers (last two versions)",,,,,,"2016-03-04 22:04:16","2016-03-04 22:14:10",24c486d1c9
35854e5b99e764fe6a0743ec9cbcd277,"North America","College degree, computer science",,,,"Ember Slack",,,,,,,Twitter,,,,"Podcasts (e.g. EmberWeekend, Ember Land)",,,,,,,,,,,,,No,"36–51 months",8,9,Developer,,,,,,"Leadership position (CTO, VP etc)",,"All the time","Employee working on product(s)",,,,,,Ruby,,,,,,,,,,,,,Vim,,,,,,,,"Opened an issue","Opened a PR","Maintain a library or addon","Attended a meetup / conference","Presented at a meetup","Presented at a conference","Written a blog post / article","Given a talk / lecture / class","Member of an official Ember team",,,"Mac OSX",,,Angular,,,,,,,,,,,1–10,,,,,,,1–10,,,,,,,"The same amount","No requirement",0,,,,,,,,,,,,,2.3,,,,,,"Release (stable release like 2.4.1)",,,,,,,,,,,,,,,,,,,,None,,,,,,,2.4,,"Standard Ember templates (Handlebars/HTMLBars/Glimmer)",,,,Ember-CLI,,,,,,,Ruby,,,,,,,,,,,"Rails (Ruby)",,,,,,,,,,,,,,,,,,,,,,"Custom design",," Ember-QUnit (Ember-CLI default)",,,,,,,,,,,"18–24 months",,,,"Every few days",,,,,,,,,Git,,,,,,,,,,"Platform-specific deployment tool (e.g. Surge, Pagefront, Firebase, Heroku, GCP)",,,"Username / password",,,,"No authentication",,,,,,,"Mobile native (Cordova/Phonegap/Crosswalk)",,,"The general public",,,"Mobile browsers",,,,,,,"Mobile browsers",,,,,,,,,"An app that is used by hundreds of users",,,,,,"S3 (with or without CloudFront)",,,,,,,,,,"GitHub (public/private)",,,,,,"App is private, behind an authentication flow, or this question generally does not apply",,,,,,4–6,1–3,All,All,,,,,,,,1.12,1.13,2.0,2.1,2.2,2.3,2.4,,,,,"Modern browsers (last two versions)",,,,,,"2016-03-04 22:07:34","2016-03-04 22:14:48",4e8a96b4bb
a1841ebb4bdfbccaa4c194dac7384421,"North America","College degree, not technology related",,,"Reading code and examples",,"emberjs.com blog","Source code, issue and PR tracking",Blogs,,"Screencasts or video training",,Twitter,,,"Newsletters (e.g. Ember Weekly)","Podcasts (e.g. EmberWeekend, Ember Land)","Local meetups",Conferences,discuss.emberjs.com,,,,,,"Person with a lesbian, gay, bisexual, queer, or other non-heterosexual sexual identity",,,,,"36–51 months",9,9,Developer,,,,,,,,"All the time","Employee working on product(s)",,,,,,,,JavaScript,PHP,,,,,Scala,,,"Sublime Text",,,,,,,,,,"Opened an issue","Opened a PR","Maintain a library or addon","Attended a meetup / conference",,"Presented at a conference",,,,,,"Mac OSX",,,Angular,,,,,"jQuery Mobile",,,,,,1–10,,,,,,,1–10,,,,,,,More,"No requirement",0,,,,,,,,,,,,,2.3,,,,,,"Release (stable release like 2.4.1)",,,,,,,,,2.3,,,,,,,,,,,,,,,,,2.3,,,"Standard Ember templates (Handlebars/HTMLBars/Glimmer)",,,,Ember-CLI,,,,,,,Ruby,,,,,,,,Scala,,,,"Sinatra (Ruby)",,,,,,"Express (Node)",,,,,,,,JSON-API,,,,,"A non-standards based library",,,," Ember-QUnit (Ember-CLI default)",,,,,,,,,,"12–18 months",,,,,"Every few days",,,,,,"Ember-CLI Deploy",Jenkins,,,,,,,,,,,,,,,"Username / password",,,,,,,"Desktop (not responsive)",,,,,,,,"Business consumers",,,"Modern browsers (last two versions)",,"IE 11","IE 10",,,,"Modern browsers (last two versions)",,,,,,,,,"An app that is used by thousands of users",,,,,"S3 (with or without CloudFront)",,,,,,,,,,"GitHub (public/private)",,,,,,,,,"Google's JavaScript execution",,,1–3,1–3,All,All,,,,,,,,,1.13,2.0,2.1,2.2,2.3,,,,,,"Modern browsers (last two versions)",,,,,,"2016-03-04 22:10:14","2016-03-04 22:15:05",61aed35ef9