#,How likely are you to recommend Ember to your friends and colleagues?,Please explain your reasoning for your previous answer.,Books / ebooks,Code and examples,Conference presentations (in-person or video),discuss.emberjs.com,Ember Community Slack,Ember Core Notes Repo,Ember Github PRs,Ember Guides & API Docs,Ember RFC's,emberjs.com blog,In-person or other formal training,IRC,Local meetups,Newsletters,Podcasts,Reddit,Screencasts or video training,Stack Overflow,Twitter,Other,How long have you been working with Ember?,Grade your knowledge of JavaScript,Grade your knowledge of Ember,"JavaScript Modules (import, export, etc.)",JavaScript async/await,"Customizing ember-data, via adapters and serializers",Managing application state,Managing CSS complexity,Writing basic tests,Building your own test helpers,Composition with components,Engines,Fastboot & server-side rendering,Progressive Web App Technologies,Debugging,Node.js,Using the ember-data store,Component lifecycle,Routing & the Router,Promises,Measuring client-side performance,Closure actions,I use Ember for work...,When starting your most recent job...,"When getting hired to your most recent job, your pre-existing knowledge of Ember was",Software Developer / Engineer,Designer,Project manager,Dev-Ops,Systems administration,Student,"Leadership position (CTO, VP, etc.)",Other,Employee working on product(s),Employee in a firm doing consulting/client work,Employee working on internal Ember tooling,Independent product developer,Independent consultant,Employed in a non-programming field,Student / Unemployed,Other,Atom,Emacs,Notepad++,Sublime Text,Vim,Visual Studio,VS Code,WebStorm / IntelliJ / Other Jetbrains,Other,"Answering questions on discussion forums (e.g. Slack, StackOverflow, discuss.emberjs.com)",Writing blog posts / articles,Attending meetups / conferences,Presenting at events / lectures,Opening or commenting on issues,Opening PRs,Creating RFCs,Commenting on RFCs,Maintaining a library or addon,None of these,Other,Mac OS,Linux / Unix,Windows,Other,Angular 1.x,Angular 2.x,Backbone,Ionic,jQuery / jQuery Mobile,Knockout,Marionette,Meteor,Polymer,Preact,React,"Sencha (ExtJS, Sencha Touch)",Sproutcore,Vue,None (Ember.js is my first framework),Other,How many developers are employed at your company?,How many developers at your company are responsible for writing Ember code?,"At this time next year, how many Ember developers does your company plan to employ?",What are the accessibility requirements for your business?,Does your business require applications to be internationalized?,Agriculture,Advertising,Arts & Entertainment,Consulting,Education,Financial Services,Government,Health Care & Social Assistance,Insurance,Real Estate,Retailers (including online),Technology,"Utilities (telecom, energy)",Social Networking,Transportation,"Travel, Hospitality or Food Services",Other,pre 1.13,1.13,2,2.1,2.2,2.3,2.4 LTS,2.5,2.6,2.7,2.8 LTS,2.9,2.1,2.11,2.12,Beta,Canary (master),Custom fork,I don't know,"Release (stable release, e.g. 2.11.0)",Beta (e.g. 2.13.0-beta),Canary,LTS (e.g. 2.8.3),pre 1.13,1.13,2,2.1,2.2,2.3,2.4,2.5,2.6,2.7,2.8,2.9,2.1,2.11,2.12,Beta,Canary (master),Custom fork,I don't know,pre 1.13,1.13,2.0 - 2.4,2.5 - 2.8,2.9,2.1,2.11,2.12,Beta,Canary (master),Custom fork,I don't know,"Broccoli, without Ember-CLI",Ember-CLI,Ember-CLI-Rails,Grunt,Gulp,Webpack,Custom shell scripts,Other,.NET,C++,Clojure,Elixir / Erlang,Go,Java,JavaScript,PHP,Python,Ruby,Rust,Scala,TypeScript,Other,CakePHP (PHP),Django (Python),Express (JavaScript),Flask (Python),Grails (Java),Grape (Ruby),Hapi (JavaScript),Koa (JavaScript),Laravel (PHP),MVC (.NET),Phoenix (Elixir),Play (Scala/Java),Rails (Ruby),Sails.js (JavaScript),Sinatra (Ruby),Spring (Java),Spring Boot (Java),Dropwizard (Java),Symfony (PHP),None (no server-side framework),Other,Falcor,GraphQL,HAL,HATEOAS,JSON-API,Rest.li,"A non-standards based library (such as ActiveModelSerializers 0.8, etc.)",Custom design,I am unsure,Other,Ava,Blanket.js,Capybara,Ember-Mocha, Ember-QUnit (Ember-CLI default),Jasmine,Jest,Karma,Selenium (Cucumber),Tape,I don’t write tests,Other,< 3 months,3–6 months,6–9 months,9–12 months,1–1.5 years,1.5–2 years,2+ years,Multiple times per day,Daily,Every few days,Weekly,Monthly,Less than once a month,Almost never,Haven’t shipped yet / Still developing,Ansible,App Store / Native Shell (Google Play / App Store / Ad Hoc),Bamboo,Capistrano,Chef,Circle CI,Codeship,Custom / Shell scripts,Docker,Ember-CLI Deploy,Fabric,FTP,Git,Gitlab CI,Grunt,Gulp,Heroku,Jenkins / Hudson,"Platform-specific deployment tool (e.g. Surge, Pagefront, Firebase)",Puppet,Rake,Rsync / SCP,Rundeck,Salt,Team City,Travis CI,Other,Desktop & mobile (fully responsive),Desktop (not responsive),Mobile web (not responsive),"Legacy desktop (Point-of-sale units, embedded devices)",Browser extension (Chrome/Firefox etc.),Mobile native (Cordova/Phonegap/Crosswalk),Desktop native (Electron/NW.js/MacGap/CEF),Other,The general public (B2C),Business consumers (B2B),Internal users,Mobile browsers,"Modern browsers (last two versions, Chrome, Firefox, Edge, Safari, etc.)","Legacy Chrome, Firefox, Safari, etc.",IE 11,IE 10,IE 9,IE 8,Other,Mobile browsers,"Modern browsers (last two versions, Chrome, Firefox, Edge, Safari, etc.)","Legacy Chrome, Firefox, Safari, etc.",IE 11,IE 10,IE 9,IE 8,Other,Prototypes only,An app that is used by tens of users,An app that is used by hundreds of users,An app that is used by thousands of users,An app that is used by millions of users,"Amazon Web Services (AWS, such as S3, ElasticBeanstalk, Lambda)",Azure,Cloudant,Firebase,Github Pages,Google Cloud,Heroku,Netlify,Pagefront,Rackspace Cloud,Self-hosted (dedicated infrastructure),Surge.sh,VPS (cloud infrastructure),Zeit,Other,Assembla,Beanstalk,Bitbucket,GitHub (enterprise),GitHub (public/private),Gitlab EE,Gitlab CE (self-hosted),Perforce,Stash,TFS,Visual Studio Team Services,Self-hosted,No source control is used,Other,In a shared repository with the API code,In a separate repository from the API code,No source control is used,FastBoot or other use of the "visit" API.,noscript tags,phantomjs or other pre-rendering,Search engine JavaScript execution,"My apps are indexable, but I don't know how","App is private, behind an authentication flow, or this question generally does not apply",Other,How many addons have you written?,How many addons have you published publicly?,Unit tests,Integration tests,Acceptance tests,None,I'm not sure how to do this,pre 1.13,1.13,2,2.1,2.2,2.3,2.4 LTS,2.5,2.6,2.7,2.8 LTS,2.9,2.1,2.11,2.12,Beta,Canary (master),Custom fork,I don't know,Mobile browsers,"Modern browsers (last two versions, Chrome, Firefox, Edge, Safari, etc.)","Legacy Chrome, Firefox, Safari, etc.",IE 11,IE 10,IE 9,IE 8,Other,Africa,Asia,Oceania,Europe,North America,Central America,South America,Other,What is your current level of education?,Other,"What is the most important thing the Ember project could do better today (technically, or organizationally)?",Start Date (UTC),Submit Date (UTC),Network ID
2e34e0acd9fc4ff93f1526b5e43a99ca,10,Because I like Ember.js and its community.,,Code and examples,,,Ember Community Slack,,,,,emberjs.com blog,,,,,Podcasts,,,,,,2–3 years,Advanced,Advanced,"JavaScript Modules (import, export, etc.)",JavaScript async/await,,Managing application state,,Writing basic tests,,,,Fastboot & server-side rendering,Progressive Web App Technologies,Debugging,,,,,Promises,,Closure actions,All the time,My employer was already using Ember,Very important,Software Developer / Engineer,,,,,,,Consultant,,Employee in a firm doing consulting/client work,,,,,,,,,,,Vim,,,,,,,,,,,,,,,Podcasting,Mac OS,,,,Angular 1.x,,Backbone,,jQuery / jQuery Mobile,,Marionette,,,,,,,,,,1–10,1–10,The same amount,I don't know,1,,,,,,,,,,,,Technology,,,,,,,,,,,,,,,,2.8 LTS,,,,2.12,Beta,Canary (master),,,,,,LTS (e.g. 2.8.3),,,,,,,,,,,,,,,2.12,Beta,Canary (master),,,,,,,,,,2.12,Beta,Canary (master),,,,Ember-CLI,,,,,,,,,,,,,,,,Ruby,,,,,,,,,,,,,,,,,Rails (Ruby),,,,,,,,,,,,,JSON-API,,,,,,,,,, Ember-QUnit (Ember-CLI default),,,,,,,,,,,,,1.5 - 2 years,,,,Every few days,,,,,,,,,,,,,,,,,,,,,,Heroku,,,,,,,,,,,Desktop & mobile (fully responsive),,,,,,,,The general public (B2C),,,,"Modern browsers (last two versions, Chrome, Firefox, Edge, Safari, etc.)",,,,,,,,"Modern browsers (last two versions, Chrome, Firefox, Edge, Safari, etc.)",,,,,,,,,An app that is used by hundreds of users,,,,,,,,,Heroku,,,,,,,,,,,,,GitHub (public/private),,,,,,,,,,,In a separate repository from the API code,,FastBoot or other use of the "visit" API.,,,,,,,1–3,1–3,Unit tests,Integration tests,Acceptance tests,,,,1.13,,,,,2.4 LTS,,,,2.8 LTS,,,,2.12,,,,,,"Modern browsers (last two versions, Chrome, Firefox, Edge, Safari, etc.)",,,,,,,,,,,North America,,,,"College degree, not technology related",,,2/28/2017 21:55,2/28/2017 22:06,f8b5bb4726
70f4bdfd15d3e147f9b2b38fad283e88,7,There are no tutorials explaining creating an application from start to finish,Books / ebooks,Code and examples,,,Ember Community Slack,,,,,,,,,,,,Screencasts or video training,Stack Overflow,,,< 3 months,Beginner,Beginner,,,,,,,,,,,,,,,,Routing & the Router,,,,Never,Does not apply (e.g. I am a student),I did not know Ember,Software Developer / Engineer,,,,,,,,Employee working on product(s),,,,,,,,Atom,,,,,,,,,,,,,,,,,,None of these,,,Linux / Unix,Windows,,Angular 1.x,,,,,Knockout,,,,,,"Sencha (ExtJS, Sencha Touch)",,Vue,,,21–50,None,I don’t know,No requirements,1,,,,,,Financial Services,,,,,,,,,,,,,,,,,,,,,,,,,,2.12,,,,I don't know,"Release (stable release, e.g. 2.11.0)",,,,,,,,,,,,,,,,,,,,,,I don't know,,,,,,,,,,,,I don't know,,Ember-CLI,,,,Webpack,,,,,,,,,,PHP,,,,,,c#,,,Express (JavaScript),,,,,,,MVC (.NET),,,,,,,,,,,,,,,,JSON-API,,,,,,,,,,,,,,,,I don’t write tests,,< 3 months,,,,,,,,,,,,,,Haven’t shipped yet / Still developing,,,,,,,,,,,,,,,,,Heroku,,,,,,,,,,,Desktop & mobile (fully responsive),,,,,,,,,Business consumers (B2B),,,"Modern browsers (last two versions, Chrome, Firefox, Edge, Safari, etc.)",,,,,,,Mobile browsers,"Modern browsers (last two versions, Chrome, Firefox, Edge, Safari, etc.)",,,,,,,Prototypes only,,,,,,Azure,,,,,Heroku,,,,,,,,,,,,,,,,,,,Visual Studio Team Services,,,,,In a separate repository from the API code,,,,,,,"App is private, behind an authentication flow, or this question generally does not apply",,0,0,,,,,I'm not sure how to do this,,,,,,,,,,,,,,,,,,,I don't know,,"Modern browsers (last two versions, Chrome, Firefox, Edge, Safari, etc.)",,,,,,,,,,,,,South America,,"Some college, technology related",,,2/28/2017 23:18,2/28/2017 23:33,d6cdd046b3
80ef820e3c38de8515b7f1ad36404970,10,Community is great. Awesome not having to make inconsequential choices. ,,Code and examples,,,,,,,,,,,,,,,Screencasts or video training,,,,4+ years,Advanced,Advanced,"JavaScript Modules (import, export, etc.)",JavaScript async/await,"Customizing ember-data, via adapters and serializers",Managing application state,Managing CSS complexity,Writing basic tests,,Composition with components,,,,Debugging,Node.js,Using the ember-data store,Component lifecycle,Routing & the Router,Promises,,Closure actions,All the time,My employer was not using Ember,Very important,Software Developer / Engineer,,,,,,,,Employee working on product(s),,,,,,,,Atom,,,,,,,,,,,,,,,,,Maintaining a library or addon,,,Mac OS,,,,,,Backbone,,jQuery / jQuery Mobile,,Marionette,,,,React,,Sproutcore,,,,11–20,1–10,More,No requirements,0,,Advertising,,,,,,,,,,,,Social Networking,,,,,,,,,,,,,,2.8 LTS,,,,,,,,,,,,LTS (e.g. 2.8.3),,,,,,,,,,,2.8,,,,,,,,,,,,,,,,2.12,,,,,,Ember-CLI,,,,,,,,,,,,,JavaScript,,,Ruby,,,,,,,Express (JavaScript),,,,,,,,,,Rails (Ruby),,,,,,,,,,,,,JSON-API,,,,,,,,,, Ember-QUnit (Ember-CLI default),,,,,,,,,,,,,1.5 - 2 years,,Multiple times per day,,,,,,,,,,,,,,,,,,,,,,,,Heroku,,,,,,,,,,,Desktop & mobile (fully responsive),,,,,,,,,Business consumers (B2B),Internal users,Mobile browsers,"Modern browsers (last two versions, Chrome, Firefox, Edge, Safari, etc.)",,,,,,,Mobile browsers,"Modern browsers (last two versions, Chrome, Firefox, Edge, Safari, etc.)",,,,,,,,,,An app that is used by thousands of users,,"Amazon Web Services (AWS, such as S3, ElasticBeanstalk, Lambda)",,,,,,Heroku,,,,,,,,,,,,,GitHub (public/private),,,,,,,,,,,In a separate repository from the API code,,,,,,,"App is private, behind an authentication flow, or this question generally does not apply",,> 6,1–3,Unit tests,,,,,,,,,,,2.4 LTS,,,,2.8 LTS,,,,,,,,,Mobile browsers,"Modern browsers (last two versions, Chrome, Firefox, Edge, Safari, etc.)",,,,,,,,,,,North America,,,,"Advanced degree, technology related",,,3/1/2017 1:27,3/1/2017 1:33,465ec1924d
1d31544cd74b7ccd23367ab1f6e16043,10,,,,Conference presentations (in-person or video),,Ember Community Slack,Ember Core Notes Repo,Ember Github PRs,,Ember RFC's,emberjs.com blog,,,,,,,,,,,2–3 years,Advanced,Advanced,"JavaScript Modules (import, export, etc.)",,"Customizing ember-data, via adapters and serializers",Managing application state,,Writing basic tests,Building your own test helpers,Composition with components,,,,Debugging,,Using the ember-data store,Component lifecycle,Routing & the Router,Promises,,Closure actions,Never,My employer was not using Ember,Unimportant,Software Developer / Engineer,,,,,,,,Employee working on product(s),,,,,,,,,,,,Vim,,,,,,,,,,Opening PRs,,Commenting on RFCs,,,,Mac OS,,,,,,,,jQuery / jQuery Mobile,Knockout,,,,,React,,,,,,11–20,None,I don’t know,Required by law to provide accessibility,0,,,,,,,,,,,,Technology,,,,,,,,,,,,,,,,2.8 LTS,,,2.11,2.12,Beta,,,,"Release (stable release, e.g. 2.11.0)",,,,,,,,,,,,,,,,2.1,,,,,,,,,,,,,,2.12,,,,,,Ember-CLI,,,,,,,,,,,Go,,,,,,,,,,,,,,,,,,,,,,,,,,,,,None (no server-side framework),,,GraphQL,,,,,,,,,,,,, Ember-QUnit (Ember-CLI default),,,,,,,,,,,,1 - 1.5 years,,,,,,Weekly,,,,,,,,,,,,,,,,,Git,,,,,,,,,,,,,,,Desktop & mobile (fully responsive),,,,,,,,,Business consumers (B2B),,,"Modern browsers (last two versions, Chrome, Firefox, Edge, Safari, etc.)",,,,,,,,"Modern browsers (last two versions, Chrome, Firefox, Edge, Safari, etc.)",,,,,,,,,An app that is used by hundreds of users,,,,,,,,,,,,,Self-hosted (dedicated infrastructure),,,,,,,,,GitHub (public/private),,,,,,,,,,,In a separate repository from the API code,,FastBoot or other use of the "visit" API.,,,,,,,1–3,1–3,Unit tests,Integration tests,,,,,,,,,,2.4 LTS,2.5,2.6,2.7,2.8 LTS,2.9,2.1,2.11,2.12,,,,,,"Modern browsers (last two versions, Chrome, Firefox, Edge, Safari, etc.)",,,,,,,,,,Europe,,,,,"Advanced degree, computer science",,Drop support for old browsers and move to ES 6 classes ,3/1/2017 1:28,3/1/2017 1:36,6f8abe0027
d3906e00ad6fa00587ec04b43a54dbc2,6,,,Code and examples,Conference presentations (in-person or video),discuss.emberjs.com,,,,Ember Guides & API Docs,,emberjs.com blog,In-person or other formal training,,,,,,,Stack Overflow,,,6–9 months,Intermediate,Intermediate,,,,Managing application state,,,,Composition with components,,,,Debugging,,Using the ember-data store,Component lifecycle,,Promises,,Closure actions,All the time,My employer was already using Ember,I did not know Ember,Software Developer / Engineer,,,,,,,,Employee working on product(s),,Employee working on internal Ember tooling,,,,,,,Emacs,,,,,,,,,,,,,,,,,None of these,,,Linux / Unix,Windows,,Angular 1.x,,,,jQuery / jQuery Mobile,,,,,,React,,,,,,1–10,1–10,I don’t know,No requirements,0,,,,,,,,,,,,,,,,"Travel, Hospitality or Food Services",,,,,,,,,,,,,,,2.11,,,,,,"Release (stable release, e.g. 2.11.0)",,,,,,,,,,,,,,,,,2.11,,,,,,,,,,,,2.11,,,,,,,Ember-CLI,,Grunt,,,,,.NET,,,,,,,,,,,,,,,,,,,,,,,,,,,,,,,,,,Nancy,,,,,,,,Custom design,,,,,,,,,,,,,I don’t write tests,,,,,,,1.5 - 2 years,,,,Every few days,,,,,,,,,,,,,,,,,,,Gitlab CI,,,,,,,,,,,,,,Desktop & mobile (fully responsive),,,,,,,,,Business consumers (B2B),Internal users,Mobile browsers,"Modern browsers (last two versions, Chrome, Firefox, Edge, Safari, etc.)",,IE 11,,,,,Mobile browsers,"Modern browsers (last two versions, Chrome, Firefox, Edge, Safari, etc.)",,IE 11,,,,,,,,An app that is used by thousands of users,,"Amazon Web Services (AWS, such as S3, ElasticBeanstalk, Lambda)",,,,,,,,,,Self-hosted (dedicated infrastructure),,,,,,,,,,,Gitlab CE (self-hosted),,,,,,,,In a shared repository with the API code,,,,,,,,"App is private, behind an authentication flow, or this question generally does not apply",,0,0,,,,None,,,,,,,,,,,,,,,,,,,,I don't know,Mobile browsers,"Modern browsers (last two versions, Chrome, Firefox, Edge, Safari, etc.)",,IE 11,,,,,,,,,North America,,,,"College degree, technology related",,,3/1/2017 1:23,3/1/2017 1:36,31eee971a7
5e5ff127e1d7f0dff4ea64f1e77b0d76,9,,,,,,,Ember Core Notes Repo,Ember Github PRs,,Ember RFC's,,,,,,,,,,,,4+ years,Advanced,Advanced,"JavaScript Modules (import, export, etc.)",JavaScript async/await,,,,Writing basic tests,,Composition with components,,Fastboot & server-side rendering,Progressive Web App Technologies,Debugging,Node.js,,Component lifecycle,,Promises,Measuring client-side performance,Closure actions,All the time,My employer was not using Ember,Unimportant,Software Developer / Engineer,,,,,,"Leadership position (CTO, VP, etc.)",,,,Employee working on internal Ember tooling,,,,,,,,,,,,VS Code,,,,Writing blog posts / articles,Attending meetups / conferences,Presenting at events / lectures,Opening or commenting on issues,Opening PRs,Creating RFCs,Commenting on RFCs,Maintaining a library or addon,,,Mac OS,,,,Angular 1.x,,Backbone,,jQuery / jQuery Mobile,,Marionette,,,,React,,Sproutcore,,,,More than 500,101–500,More,Self-imposed requirements,1,,Advertising,,,Education,,,,,,,Technology,,Social Networking,,,,,,,,2.2,2.3,2.4 LTS,2.5,2.6,2.7,2.8 LTS,2.9,2.1,2.11,,,,,,"Release (stable release, e.g. 2.11.0)",Beta (e.g. 2.13.0-beta),Canary,LTS (e.g. 2.8.3),,,,,,,,,,,,,2.1,2.11,,,Canary (master),,,,,,,,,,2.12,,,,,"Broccoli, without Ember-CLI",Ember-CLI,,,,,,Gradle,,,,,,Java,,,,,,,,,,,,Flask (Python),Grails (Java),,,,,,,Play (Scala/Java),,,,Spring (Java),,,,,,,,,,,Rest.li,,Custom design,,,,,,, Ember-QUnit (Ember-CLI default),,,,,,,,,,,,,1.5 - 2 years,,,Daily,,,,,,,,,,,,,,,,,,,,,,,,,,,,,,,,,All custom. We build our own data centers...,,Desktop (not responsive),Mobile web (not responsive),,,,,,The general public (B2C),Business consumers (B2B),Internal users,Mobile browsers,"Modern browsers (last two versions, Chrome, Firefox, Edge, Safari, etc.)",,,,,,,Mobile browsers,"Modern browsers (last two versions, Chrome, Firefox, Edge, Safari, etc.)",,,,,,,,,,An app that is used by thousands of users,An app that is used by millions of users,,,,,,,,,,,,,,,"Akamai, Fastly",,,,,,,,,,,,Self-hosted,,,,In a separate repository from the API code,,FastBoot or other use of the "visit" API.,,,,,,,> 6,> 6,Unit tests,Integration tests,,,,,,,,,,,,,,,,,,,,,,I don't know,,,,,,,,,,,,,North America,,,,"College degree, not technology related",,Explaining the programming model. Also performance.,3/1/2017 1:28,3/1/2017 1:41,e29d77a481
019b4c88f195a0fe198ef45947165d5f,10,I like Ember and think it's a good solution ,,,,,Ember Community Slack,Ember Core Notes Repo,Ember Github PRs,Ember Guides & API Docs,Ember RFC's,emberjs.com blog,,,,,,Reddit,,,,,1–1.5 years,Intermediate,Intermediate,,,"Customizing ember-data, via adapters and serializers",,,Writing basic tests,,,,Fastboot & server-side rendering,,,,Using the ember-data store,,Routing & the Router,Promises,,Closure actions,Never,My employer was not using Ember,Unimportant,Software Developer / Engineer,,,,,,,,Employee working on product(s),,,,,,,,,,,,,,VS Code,WebStorm / IntelliJ / Other Jetbrains,,"Answering questions on discussion forums (e.g. Slack, StackOverflow, discuss.emberjs.com)",Writing blog posts / articles,,,,,,,,,,Mac OS,,,,Angular 1.x,,Backbone,,,Knockout,,,,,,,,,,Durandal,51–100,None,The same amount,Required by law to provide accessibility,0,,,,,,,Government,,,,,,,,,,,,,,,,,,,,,,,,,2.12,,,,,"Release (stable release, e.g. 2.11.0)",,,,,,,,,,,,,,,,,,2.12,,,,,,,,,,,,2.12,,,,,,Ember-CLI,,,,,,,,,,,,,,PHP,,,,,,,,,Express (JavaScript),,,,,,Laravel (PHP),,Phoenix (Elixir),,,,,,,,,,,,,,,JSON-API,,,,,,,,,, Ember-QUnit (Ember-CLI default),,,,,,,,< 3 months,,,,,,,,,Every few days,,,,,,,,,,,,Codeship,,,Ember-CLI Deploy,,,,,,,,,,,,,,,,,,Desktop & mobile (fully responsive),,,,,,,,The general public (B2C),,Internal users,,"Modern browsers (last two versions, Chrome, Firefox, Edge, Safari, etc.)",,,,,,,,"Modern browsers (last two versions, Chrome, Firefox, Edge, Safari, etc.)",,,,,,,Prototypes only,,,,,"Amazon Web Services (AWS, such as S3, ElasticBeanstalk, Lambda)",,,,,,Heroku,,,,,,,,,,,Bitbucket,,GitHub (public/private),,,,,,,,,,,In a separate repository from the API code,,FastBoot or other use of the "visit" API.,,,,,,,0,0,,,,None,,,,,,,,,,,,,,,,,,,,I don't know,,,,,,,,NO FUCKING ADDONS,,,Oceania,,,,,,"Some college, not technology related",,Performance and advocacy- people don't know Ember but know it's slow. ,3/1/2017 1:31,3/1/2017 1:44,5bb908ca45
9163d2beffea4f6147cb877733ae584f,10,ember makes them a better developer.,,Code and examples,Conference presentations (in-person or video),,,,,,,emberjs.com blog,,,,Newsletters,Podcasts,,Screencasts or video training,Stack Overflow,Twitter,,3–4 years,Advanced,Advanced,"JavaScript Modules (import, export, etc.)",JavaScript async/await,"Customizing ember-data, via adapters and serializers",Managing application state,Managing CSS complexity,,,Composition with components,Engines,,Progressive Web App Technologies,,Node.js,Using the ember-data store,Component lifecycle,Routing & the Router,Promises,,Closure actions,All the time,My employer was not using Ember,Very important,Software Developer / Engineer,,Project manager,Dev-Ops,,,,,Employee working on product(s),,Employee working on internal Ember tooling,,,,,,Atom,,,Sublime Text,Vim,,VS Code,WebStorm / IntelliJ / Other Jetbrains,,,Writing blog posts / articles,,,,,,,,,,,Linux / Unix,,,Angular 1.x,,,,jQuery / jQuery Mobile,,,,,,React,,Sproutcore,Vue,,,1–10,1–10,I don’t know,I don't know,1,,Advertising,Arts & Entertainment,,,,,,,,,,,Social Networking,,,,,,2,2.1,2.2,2.3,2.4 LTS,2.5,2.6,2.7,2.8 LTS,2.9,2.1,2.11,2.12,,,,,"Release (stable release, e.g. 2.11.0)",Beta (e.g. 2.13.0-beta),,,,,2,2.1,2.2,2.3,2.4,2.5,2.6,2.7,2.8,2.9,2.1,2.11,2.12,Beta,Canary (master),,,,,2.0 - 2.4,2.5 - 2.8,2.9,2.1,2.11,2.12,,,,,,Ember-CLI,,,,,,,,,,,,Java,JavaScript,,Python,Ruby,,,,,,Django (Python),Express (JavaScript),,,,,,Laravel (PHP),,,,Rails (Ruby),,,,,,,,,,,,,JSON-API,,,,,,,,,,,,,,,,I don’t write tests,,,,,,,1.5 - 2 years,,,,,,Monthly,Less than once a month,,,,,,,,,,Custom / Shell scripts,,Ember-CLI Deploy,,,,,,,,,,,,,,,,,,Desktop & mobile (fully responsive),Desktop (not responsive),Mobile web (not responsive),,,Mobile native (Cordova/Phonegap/Crosswalk),Desktop native (Electron/NW.js/MacGap/CEF),,The general public (B2C),,,Mobile browsers,"Modern browsers (last two versions, Chrome, Firefox, Edge, Safari, etc.)",,,,,,,Mobile browsers,"Modern browsers (last two versions, Chrome, Firefox, Edge, Safari, etc.)",,,,,,,Prototypes only,An app that is used by tens of users,An app that is used by hundreds of users,,,,,,,,Google Cloud,,,,,Self-hosted (dedicated infrastructure),Surge.sh,VPS (cloud infrastructure),,,,,Bitbucket,,GitHub (public/private),,,,,,,,,,,In a separate repository from the API code,,FastBoot or other use of the "visit" API.,,,Search engine JavaScript execution,,,,0,0,,,,,I'm not sure how to do this,,,,,,,,,,,,,,,,,,,I don't know,Mobile browsers,"Modern browsers (last two versions, Chrome, Firefox, Edge, Safari, etc.)",,,,,,,,Asia,,,,,,,"Some college, computer science",,,3/1/2017 1:27,3/1/2017 1:48,e86e95f264